Target
Isochorismatase family protein
Ligand
BDBM92851
Substrate
Meas. Tech.
GDH-Coupled Nicotinamidase Assay
Ki
140±20 nM
Citation
 French, JBCen, YVrablik, TLXu, PAllen, EHanna-Rose, WSauve, AA Characterization of nicotinamidases: steady state kinetic parameters, classwide inhibition by nicotinaldehydes, and catalytic mechanism. Biochemistry 49:10421-39 (2010)  
Target
Name:
Isochorismatase family protein
Synonyms:
Nicotinamidase (SpNic) | Pyrazinamidase/nicotinamidase
Type:
Enzyme
Mol. Mass.:
21361.69
Organism:
Streptococcus pneumoniae
Description:
A0A098ZGI7
Residue:
191
  
Inhibitor
Name:
BDBM92851
Synonyms:
Nicotinamidase Inhibitor, 18
Type:
Small molecule
Emp. Form.:
C7H7NO2
Mol. Mass.:
137.136
SMILES:
COc1cncc(C=O)c1
: