Target
Isochorismatase family protein
Ligand
BDBM92852
Substrate
Meas. Tech.
GDH-Coupled Nicotinamidase Assay
Ki
56±2 nM
Citation
 French, JBCen, YVrablik, TLXu, PAllen, EHanna-Rose, WSauve, AA Characterization of nicotinamidases: steady state kinetic parameters, classwide inhibition by nicotinaldehydes, and catalytic mechanism. Biochemistry 49:10421-39 (2010)  
Target
Name:
Isochorismatase family protein
Synonyms:
Nicotinamidase (SpNic) | Pyrazinamidase/nicotinamidase
Type:
Enzyme
Mol. Mass.:
21361.69
Organism:
Streptococcus pneumoniae
Description:
A0A098ZGI7
Residue:
191
  
Inhibitor
Name:
BDBM92852
Synonyms:
Nicotinamidase Inhibitor, 19
Type:
Small molecule
Emp. Form.:
C7H7NO
Mol. Mass.:
121.1366
SMILES:
Cc1cncc(C=O)c1
: