Target
AP2-associated protein kinase 1
Ligand
BDBM279512
Substrate
Meas. Tech.
AAK1 Kinase Assay
pH
7.4±n/a
Temperature
298.15±n/a K
IC50
12.0±n/a nM
Comments
extracted
Citation
 Dzierba, CDBronson, JJMacor, JEDasgupta, BNara, SJVrudhula, VMPan, SHartz, RARajamani, R Heterocyclic kinase inhibitors US Patent  US10035777 Publication Date 7/31/2018 
Target
Name:
AP2-associated protein kinase 1
Synonyms:
AAK1 Adaptor-associated kinase 1 | KIAA1048
Type:
PROTEIN
Mol. Mass.:
103884.23
Organism:
Homo sapiens (Human)
Description:
ChEMBL_774569
Residue:
961
  
Inhibitor
Name:
BDBM279512
Synonyms:
N,3-dimethyl-1-(5-(pyridin-4-yl)-1H-benzo[d]imidazol-2-yl) butan-1-amine | US10035777, Example 62
Type:
Small organic molecule
Emp. Form.:
C18H28BrN3O3
Mol. Mass.:
414.337
SMILES:
CC(C)C[C@@H](N(C)C(=O)OC(C)(C)C)C(=O)Nc1ccc(Br)cc1N
: