Target
Genome polyprotein
Ligand
BDBM92892
Substrate
Meas. Tech.
Competitive Inhibition Assay
Ki
520±200 nM
Citation
 Dahl, GArenas, OGDanielson, UH Hepatitis C virus NS3 protease is activated by low concentrations of protease inhibitors. Biochemistry 48:11592-602 (2009)  
Target
Name:
Genome polyprotein
Synonyms:
NS3 protein
Type:
Protein
Mol. Mass.:
45665.89
Organism:
Hepatitis C virus
Description:
Q04045
Residue:
428
  
Inhibitor
Name:
BDBM92892
Synonyms:
NS3 Protease Inhibitor, 3
Type:
Small molecule
Emp. Form.:
C32H38N4O12S
Mol. Mass.:
702.729
SMILES:
OC(=O)CC[C@H](NC(=O)[C@H](CCC(O)=O)NC(=O)[C@@H](NC(=O)CCC(O)=O)C(c1ccccc1)c1ccccc1)C(=O)N[C@@H](CS)C(O)=O
: