Target
Genome polyprotein
Ligand
BDBM92893
Substrate
Meas. Tech.
Competitive Inhibition Assay
Ki
150±53 nM
Citation
 Dahl, GArenas, OGDanielson, UH Hepatitis C virus NS3 protease is activated by low concentrations of protease inhibitors. Biochemistry 48:11592-602 (2009)  
Target
Name:
Genome polyprotein
Synonyms:
NS3 protein
Type:
Protein
Mol. Mass.:
45665.89
Organism:
Hepatitis C virus
Description:
Q04045
Residue:
428
  
Inhibitor
Name:
BDBM92893
Synonyms:
NS3 Protease Inhibitor, 4
Type:
Small molecule
Emp. Form.:
C29H46N4O10S
Mol. Mass.:
642.761
SMILES:
OC(=O)CC[C@H](NC(=O)[C@@H](NC(=O)CCC(O)=O)C1CCCCC1)C(=O)N[C@@H](CC1CCCCC1)C(=O)N[C@@H](CS)C(O)=O
: