Target
3-oxoacyl-[acyl-carrier-protein] synthase 1
Ligand
BDBM93045
Substrate
Meas. Tech.
Binding Fluorescence Titrations
pH
8.5±0
Ki
4.69e+4± 1.0e+3 nM
Citation
 Kapilashrami, KBommineni, GRMachutta, CAKim, PLai, CTSimmerling, CPicart, FTonge, PJ Thiolactomycin-based ß-Ketoacyl-AcpM Synthase A (KasA) Inhibitors: FRAGMENT-BASED INHIBITOR DISCOVERY USING TRANSIENT ONE-DIMENSIONAL NUCLEAR OVERHAUSER EFFECT NMR SPECTROSCOPY. J Biol Chem 288:6045-52 (2013)  
Target
Name:
3-oxoacyl-[acyl-carrier-protein] synthase 1
Synonyms:
Beta-ketoacyl-ACP synthase (KasA) C171Q kasA
Type:
Protein
Mol. Mass.:
43305.57
Organism:
Mycobacterium tuberculosis
Description:
P9WQD8
Residue:
416
  
Inhibitor
Name:
BDBM93045
Synonyms:
TLM analog, 2
Type:
Small molecule
Emp. Form.:
C10H12O2S
Mol. Mass.:
196.266
SMILES:
C\C(C=C)=C/[C@@]1(C)SC(=O)CC1=O
: