Target
Complement C1s subcomponent
Ligand
BDBM93100
Substrate
Meas. Tech.
Enzymatic Assay
pH
8.05±0
Temperature
298.65±0 K
Ki
370000±0.0 nM
Citation
 Bing, DH Nature of the active site of a subunit of the first component of human complement. Biochemistry 8:4503-10 (1969)  
Target
Name:
Complement C1s subcomponent
Synonyms:
C1 esterase C1S_HUMAN Complement C1s subcomponent Complement C1s subcomponent light chain Trypsin | complement component 1, s subcomponent
Type:
Protein
Mol. Mass.:
76657.91
Organism:
Homo sapiens (Human)
Description:
P09871
Residue:
688
  
Inhibitor
Name:
BDBM93100
Synonyms:
N-z-L-Tyr
Type:
Small molecule
Emp. Form.:
C16H14NO4
Mol. Mass.:
284.2872
SMILES:
Oc1ccc(CC(NC(=O)c2ccccc2)C([O-])=O)cc1
: