Target
Tyrosine-protein kinase ABL1
Ligand
BDBM93207
Substrate
Meas. Tech.
Fluorescence Assay
pH
7.5±0
Temperature
298.15±0 K
IC50
<2.0±0.0 nM
Citation
 Brigham, JLPerera, BGMaly, DJ A Hexylchloride-Based Catch-and-Release System for Chemical Proteomic Applications. ACS Chem Biol 8:691-9 (2013)  
Target
Name:
Tyrosine-protein kinase ABL1
Synonyms:
ABL ABL1_HUMAN JTK7 Proto-oncogene tyrosine-protein kinase ABL1 Tyrosine-protein kinase ABL V-abl Abelson murine leukemia viral oncogene homolog 1 p150 | tyrosine-protein kinase ABL1 isoform a
Type:
Enzyme
Mol. Mass.:
122897.30
Organism:
Homo sapiens (Human)
Description:
P00519
Residue:
1130
  
Inhibitor
Name:
BDBM93207
Synonyms:
Kinase inhibitor, 5
Type:
Small molecule
Emp. Form.:
C31H26F3N5O2
Mol. Mass.:
557.5656
SMILES:
Cc1ccc(NC(=O)c2cccc(c2)C(F)(F)F)cc1-c1ccc2nc(Nc3ccc(OCCN)cc3)ncc2c1
: