Target
Beta-secretase 1
Ligand
BDBM279659
Substrate
Meas. Tech.
Inhibition of Human BACE-1
pH
4.5±n/a
Temperature
298.15±n/a K
IC50
2600±n/a nM
Comments
extracted
Citation
 Badiger, SChebrolu, MHurth, KJacquier, SLueoend, RMMachauer, RRueeger, HTintelnot-Blomley, MVeenstra, SJVoegtle, M Heterocyclic derivatives and their use in the treatment of neurological disorders US Patent  US10035794 Publication Date 7/31/2018 
Target
Name:
Beta-secretase 1
Synonyms:
ASP2 Aspartyl protease 2 BACE1 Beta-secretase (BACE) Beta-secretase 1 (BACE 1) Beta-secretase 1 (BACE1) Beta-site amyloid precursor protein cleaving enzyme 1 Memapsin-2 beta-Secretase (BACE-1) | beta-Secretase (BACE1)
Type:
Protein
Mol. Mass.:
55755.10
Organism:
Homo sapiens (Human)
Description:
P56817
Residue:
501
  
Inhibitor
Name:
BDBM279659
Synonyms:
5-{6-[(5-Chloro-pyridine-2-carbonyl)-amino]-pyridin-2-yl}-5-fluoromethyl-5,6-dihydro-2H-[1,4]oxazin-3-yl-ammonium trifluoro acetate | US10035794, Example 3
Type:
Small organic molecule
Emp. Form.:
C16H15ClFN5O2
Mol. Mass.:
363.774
SMILES:
NC1=NC(CF)(COC1)c1cccc(NC(=O)c2ccc(Cl)cn2)n1
: