Target
Beta-secretase 1
Ligand
BDBM116234
Substrate
Meas. Tech.
Inhibition of Human BACE-1
pH
4.5±n/a
Temperature
298.15±n/a K
IC50
6200±n/a nM
Comments
extracted
Citation
 Badiger, SChebrolu, MHurth, KJacquier, SLueoend, RMMachauer, RRueeger, HTintelnot-Blomley, MVeenstra, SJVoegtle, M Heterocyclic derivatives and their use in the treatment of neurological disorders US Patent  US10035794 Publication Date 7/31/2018 
Target
Name:
Beta-secretase 1
Synonyms:
ASP2 Aspartyl protease 2 BACE1 Beta-secretase (BACE) Beta-secretase 1 (BACE 1) Beta-secretase 1 (BACE1) Beta-site amyloid precursor protein cleaving enzyme 1 Memapsin-2 beta-Secretase (BACE-1) | beta-Secretase (BACE1)
Type:
Protein
Mol. Mass.:
55755.10
Organism:
Homo sapiens (Human)
Description:
P56817
Residue:
501
  
Inhibitor
Name:
BDBM116234
Synonyms:
BDBM279665 | US8637508, 9
Type:
Small organic molecule
Emp. Form.:
C19H17F3N6O2
Mol. Mass.:
418.3725
SMILES:
C[C@@]1(CO[C@](C)(C(N)=N1)C(F)(F)F)c1cccc(NC(=O)c2ccc(cn2)C#N)n1
: