Target
Beta-secretase 1
Ligand
BDBM116237
Substrate
Meas. Tech.
Inhibition of Human BACE-1
pH
4.5±n/a
Temperature
298.15±n/a K
IC50
490±n/a nM
Comments
extracted
Citation
 Badiger, SChebrolu, MHurth, KJacquier, SLueoend, RMMachauer, RRueeger, HTintelnot-Blomley, MVeenstra, SJVoegtle, M Heterocyclic derivatives and their use in the treatment of neurological disorders US Patent  US10035794 Publication Date 7/31/2018 
Target
Name:
Beta-secretase 1
Synonyms:
ASP2 Aspartyl protease 2 BACE1 Beta-secretase (BACE) Beta-secretase 1 (BACE 1) Beta-secretase 1 (BACE1) Beta-site amyloid precursor protein cleaving enzyme 1 Memapsin-2 beta-Secretase (BACE-1) | beta-Secretase (BACE1)
Type:
Protein
Mol. Mass.:
55755.10
Organism:
Homo sapiens (Human)
Description:
P56817
Residue:
501
  
Inhibitor
Name:
BDBM116237
Synonyms:
US10035794, Example 12 US8637508, 12
Type:
Small organic molecule
Emp. Form.:
C20H18F4N6O2
Mol. Mass.:
450.3895
SMILES:
Cc1cc(cnc1C(=O)Nc1ccc(F)c(n1)[C@@]1(C)CO[C@](C)(C(N)=N1)C(F)(F)F)C#N
: