Target
Beta-secretase 1
Ligand
BDBM279669
Substrate
Meas. Tech.
Inhibition of Human BACE-1
pH
4.5±n/a
Temperature
298.15±n/a K
IC50
3700±n/a nM
Comments
extracted
Citation
 Badiger, SChebrolu, MHurth, KJacquier, SLueoend, RMMachauer, RRueeger, HTintelnot-Blomley, MVeenstra, SJVoegtle, M Heterocyclic derivatives and their use in the treatment of neurological disorders US Patent  US10035794 Publication Date 7/31/2018 
Target
Name:
Beta-secretase 1
Synonyms:
ASP2 Aspartyl protease 2 BACE1 Beta-secretase (BACE) Beta-secretase 1 (BACE 1) Beta-secretase 1 (BACE1) Beta-site amyloid precursor protein cleaving enzyme 1 Memapsin-2 beta-Secretase (BACE-1) | beta-Secretase (BACE1)
Type:
Protein
Mol. Mass.:
55755.10
Organism:
Homo sapiens (Human)
Description:
P56817
Residue:
501
  
Inhibitor
Name:
BDBM279669
Synonyms:
5-{2-[(5-Chloro-4,6-dideutero-3-trideuteromethyl-pyridine-2-carbonyl)-amino]-pyridin-4-yl}-5-fluoromethyl-5,6-dihydro-2H-[1,4]oxazin-3-yl-ammonium acetate | US10035794, Example 13
Type:
Small organic molecule
Emp. Form.:
C17H17ClFN5O2
Mol. Mass.:
377.801
SMILES:
Cc1cc(Cl)cnc1C(=O)Nc1cc(ccn1)C1(CF)COCC(N)=N1
: