Target
Beta-secretase 1
Ligand
BDBM116271
Substrate
Meas. Tech.
Inhibition of Human BACE-1
pH
4.5±n/a
Temperature
298.15±n/a K
IC50
7300±n/a nM
Comments
extracted
Citation
 Badiger, SChebrolu, MHurth, KJacquier, SLueoend, RMMachauer, RRueeger, HTintelnot-Blomley, MVeenstra, SJVoegtle, M Heterocyclic derivatives and their use in the treatment of neurological disorders US Patent  US10035794 Publication Date 7/31/2018 
Target
Name:
Beta-secretase 1
Synonyms:
ASP2 Aspartyl protease 2 BACE1 Beta-secretase (BACE) Beta-secretase 1 (BACE 1) Beta-secretase 1 (BACE1) Beta-site amyloid precursor protein cleaving enzyme 1 Memapsin-2 beta-Secretase (BACE-1) | beta-Secretase (BACE1)
Type:
Protein
Mol. Mass.:
55755.10
Organism:
Homo sapiens (Human)
Description:
P56817
Residue:
501
  
Inhibitor
Name:
BDBM116271
Synonyms:
US10035794, Example 48 | US8637508, 48
Type:
Small organic molecule
Emp. Form.:
C23H23ClF4N6O3
Mol. Mass.:
542.914
SMILES:
COCCn1ccc2nc(C(=O)Nc3ccc(F)c(n3)[C@]3(C)CO[C@](C)(C(N)=N3)C(F)(F)F)c(Cl)cc12
: