Target
Protein skinhead-1
Ligand
BDBM43395
Substrate
IC50
12200±n/a nM
Citation
 PubChem, PC Dose ResponseConfirmation of SKN-1 Inhibitor hits in a fluorescence ratio assay - Set 2 PubChem Bioassay (2012)[AID] 
Target
Name:
Protein skinhead-1
Synonyms:
SKN1_CAEEL skn-1
Type:
Enzyme Catalytic Domain
Mol. Mass.:
70701.17
Organism:
Caenorhabditis elegans
Description:
P34707
Residue:
623
  
Inhibitor
Name:
BDBM43395
Synonyms:
(2E)-2-[4-(diethylamino)benzylidene]-1,3-diketo-indane-5-carboxylic acid (2E)-2-[[4-(diethylamino)phenyl]methylidene]-1,3-dioxo-5-indenecarboxylic acid 2-[1-(4-Diethylamino-phenyl)-meth-(E)-ylidene]-1,3-dioxo-indan-5-carboxylic acid SMR000218076 | cid_741762
Type:
Small organic molecule
Emp. Form.:
C21H19NO4
Mol. Mass.:
349.3799
SMILES:
CCN(CC)c1ccc(\C=C2/C(=O)c3ccc(cc3C2=O)C(O)=O)cc1
: