Target
Perilipin-1
Ligand
BDBM72328
Substrate
IC50
525.21±n/a nM
Citation
 PubChem, PC Counterscreen for inhibitors of the interaction of the lipase co-activator protein, abhydrolase domain containing 5 (ABHD5) with perilipin-5 (MLDP; PLIN5) PubChem Bioassay (2012)[AID] 
Target
Name:
Perilipin-1
Synonyms:
PERI PLIN1 | PLIN1_HUMAN
Type:
Enzyme Catalytic Domain
Mol. Mass.:
55988.69
Organism:
Homo sapiens (Human)
Description:
gi_223718203
Residue:
522
  
Inhibitor
Name:
BDBM72328
Synonyms:
(Z)-3-(4-chlorophenyl)-2-(4-keto-5,6-dimethyl-3H-thieno[2,3-d]pyrimidin-2-yl)acrylic acid ethyl ester MLS000417005 cid_6377798 ethyl (Z)-3-(4-chlorophenyl)-2-(5,6-dimethyl-4-oxo-3H-thieno[2,3-d]pyrimidin-2-yl)prop-2-enoate
Type:
Small organic molecule
Emp. Form.:
C19H17ClN2O3S
Mol. Mass.:
388.868
SMILES:
CCOC(=O)C(=Cc1ccc(Cl)cc1)c1nc2sc(C)c(C)c2c(=O)[nH]1
: