Target
Tyrosine-protein kinase transforming protein Src
Ligand
BDBM4016
Substrate
poly(E,Y)
Meas. Tech.
Kinase Inhibition Assay
pH
7.5±n/a
Temperature
298.15±n/a K
IC50
3200±n/a nM
Citation
 Rewcastle, GWPalmer, BDDobrusin, EMFry, DWKraker, AJDenny, WA Tyrosine kinase inhibitors. 3. Structure-activity relationships for inhibition of protein tyrosine kinases by nuclear-substituted derivatives of 2,2'-dithiobis(1-methyl-N-phenyl-1H-indole-3-carboxamide). J Med Chem 37:2033-42 (1994)  
Target
Name:
Tyrosine-protein kinase transforming protein Src
Synonyms:
P60-Src V-SRC | pp60v-src
Type:
Enzyme
Mol. Mass.:
58884.32
Organism:
Avian sarcoma virus
Description:
P00525
Residue:
526
  
Inhibitor
Name:
BDBM4016
Synonyms:
1-methyl-2-{[1-methyl-3-(phenylcarbamoyl)-1H-indol-2-yl]disulfanyl}-N-phenyl-1H-indole-3-carboxamide CHEMBL304414 | dithiobis(1H-indole-3-carboxamide) deriv. 10a
Type:
Small organic molecule
Emp. Form.:
C32H26N4O2S2
Mol. Mass.:
562.704
SMILES:
Cn1c(SSc2c(C(=O)Nc3ccccc3)c3ccccc3n2C)c(C(=O)Nc2ccccc2)c2ccccc12
:
Substrate
Name:
poly(E,Y)
Synonyms:
Type:
Random Polymer
Mol. Mass.:
358.43
Organism:
Description:
poly[(glu)4(tyr)l]. 5 uM ATP containing 0.2 uCi 32P labeled ATP as co-substrate.
Residue:
3
NA