Target
Nuclear receptor subfamily 5 group A member 2
Ligand
BDBM95537
Substrate
IC50
494.55±n/a nM
Citation
 PubChem, PC Luminescence-based cell-based high throughput dose response assay for inverse agonists of the liver receptor homolog-1 (LRH-1; NR5A2) PubChem Bioassay (2013)[AID] 
Target
Name:
Nuclear receptor subfamily 5 group A member 2
Synonyms:
Alpha-1-fetoprotein transcription factor B1F CYP7A promoter-binding factor Hepatocytic transcription factor Liver Receptor Homolog 1 NR5A2_HUMAN hB1F | nuclear receptor subfamily 5 group A member 2 isoform 2
Type:
Nuclear Hormone Receptor
Mol. Mass.:
61341.37
Organism:
Homo sapiens (Human)
Description:
Residue:
541
  
Inhibitor
Name:
BDBM95537
Synonyms:
3-(2-chlorophenyl)-5-methyl-4-isoxazolecarboxylic acid [(Z)-[amino-(5-nitro-2-furanyl)methylidene]amino] ester MLS000861278 SMR000460062 [(Z)-[azanyl-(5-nitrofuran-2-yl)methylidene]amino] 3-(2-chlorophenyl)-5-methyl-1,2-oxazole-4-carboxylate | cid_9566277
Type:
Small organic molecule
Emp. Form.:
C16H11ClN4O6
Mol. Mass.:
390.735
SMILES:
Cc1onc(c1C(=O)O[N-]C(=[NH2+])c1ccc(o1)[N+]([O-])=O)-c1ccccc1Cl
: