Target
Nuclear receptor subfamily 5 group A member 2
Ligand
BDBM95600
Substrate
IC50
2877±n/a nM
Citation
 PubChem, PC Luminescence-based cell-based high throughput dose response assay for inverse agonists of the liver receptor homolog-1 (LRH-1; NR5A2) PubChem Bioassay (2013)[AID] 
Target
Name:
Nuclear receptor subfamily 5 group A member 2
Synonyms:
Alpha-1-fetoprotein transcription factor B1F CYP7A promoter-binding factor Hepatocytic transcription factor Liver Receptor Homolog 1 NR5A2_HUMAN hB1F | nuclear receptor subfamily 5 group A member 2 isoform 2
Type:
Nuclear Hormone Receptor
Mol. Mass.:
61341.37
Organism:
Homo sapiens (Human)
Description:
Residue:
541
  
Inhibitor
Name:
BDBM95600
Synonyms:
2-(2-keto-3,4,7-trimethyl-chromen-5-yl)oxy-N-(3-pyridylmethyl)acetamide N-(3-pyridinylmethyl)-2-[(3,4,7-trimethyl-2-oxo-1-benzopyran-5-yl)oxy]acetamide N-(pyridin-3-ylmethyl)-2-(3,4,7-trimethyl-2-oxochromen-5-yl)oxyacetamide cid_4904346
Type:
Small organic molecule
Emp. Form.:
C20H20N2O4
Mol. Mass.:
352.3838
SMILES:
Cc1cc(OCC(=O)NCc2cccnc2)c2c(C)c(C)c(=O)oc2c1
: