Target
Trace amine-associated receptor 1
Ligand
BDBM96596
Substrate
EC50
63.37±n/a nM
Citation
 PubChem, PC Fluorescence-based cell-based high throughput dose response assay to identify agonists of the human trace amine associated receptor 1 (TAAR1) PubChem Bioassay (2013)[AID] 
Target
Name:
Trace amine-associated receptor 1
Synonyms:
TA1 TAAR1_HUMAN TRAR1 | trace amine-associated receptor 1
Type:
PROTEIN
Mol. Mass.:
39107.47
Organism:
Homo sapiens (Human)
Description:
ChEMBL_792734
Residue:
339
  
Inhibitor
Name:
BDBM96596
Synonyms:
2-(2-Phenylamino-quinazolin-4-ylamino)-ethanol 2-[(2-anilinoquinazolin-4-yl)amino]ethanol;hydrochloride MLS000528343 cid_9549592
Type:
Small organic molecule
Emp. Form.:
C16H16N4O
Mol. Mass.:
280.3244
SMILES:
OCCNc1nc(Nc2ccccc2)nc2ccccc12
: