Target
Trace amine-associated receptor 1
Ligand
BDBM96777
Substrate
EC50
>1.5±n/a nM
Citation
 PubChem, PC Fluorescence-based cell-based high throughput dose response assay to identify agonists of the human trace amine associated receptor 1 (TAAR1) PubChem Bioassay (2013)[AID] 
Target
Name:
Trace amine-associated receptor 1
Synonyms:
TA1 TAAR1_HUMAN TRAR1 | trace amine-associated receptor 1
Type:
PROTEIN
Mol. Mass.:
39107.47
Organism:
Homo sapiens (Human)
Description:
ChEMBL_792734
Residue:
339
  
Inhibitor
Name:
BDBM96777
Synonyms:
MLS001181838 N-[4-(phenylcarbamoylamino)phenyl]ethanamide SMR000567591 | cid_763210
Type:
Small organic molecule
Emp. Form.:
C15H15N3O2
Mol. Mass.:
269.2985
SMILES:
CC(=O)Nc1ccc(NC(=O)Nc2ccccc2)cc1
: