Target
cAMP and cAMP-inhibited cGMP 3',5'-cyclic phosphodiesterase 10A
Ligand
BDBM97524
Substrate
Meas. Tech.
Scintillation Proximity Assay (SPA)
pH
7.5±0
IC50
21±n/a nM
Citation
 Bleicher, KFlohr, AZbinden, KGKoerner, MKuhn, BPeters, JRodriguez-Sarmiento, RMVieira, E Nitrogen-containing heteroaryl derivatives US Patent  US8470820 Publication Date 6/25/2013 
Target
Name:
cAMP and cAMP-inhibited cGMP 3',5'-cyclic phosphodiesterase 10A
Synonyms:
3',5'-cyclic phosphodiesterase PDE10A Phosphodiesterase 10 (PDE10) | Phosphodiesterase 10A
Type:
Protein
Mol. Mass.:
88412.52
Organism:
Homo sapiens (Human)
Description:
Q9Y233
Residue:
1055
  
Inhibitor
Name:
BDBM97524
Synonyms:
US8470820, 35
Type:
Small organic molecule
Emp. Form.:
C19H17N9O
Mol. Mass.:
387.398
SMILES:
Cc1cnc(Nc2cncnc2)c(n1)C(=O)Nc1cc(nn1C)-c1ccccn1
: