Target
cAMP and cAMP-inhibited cGMP 3',5'-cyclic phosphodiesterase 10A
Ligand
BDBM97526
Substrate
Meas. Tech.
Scintillation Proximity Assay (SPA)
pH
7.5±0
IC50
2±n/a nM
Citation
 Bleicher, KFlohr, AZbinden, KGKoerner, MKuhn, BPeters, JRodriguez-Sarmiento, RMVieira, E Nitrogen-containing heteroaryl derivatives US Patent  US8470820 Publication Date 6/25/2013 
Target
Name:
cAMP and cAMP-inhibited cGMP 3',5'-cyclic phosphodiesterase 10A
Synonyms:
3',5'-cyclic phosphodiesterase PDE10A Phosphodiesterase 10 (PDE10) | Phosphodiesterase 10A
Type:
Protein
Mol. Mass.:
88412.52
Organism:
Homo sapiens (Human)
Description:
Q9Y233
Residue:
1055
  
Inhibitor
Name:
BDBM97526
Synonyms:
Roche-Dataset for PDE10A, Compound 2 | US8470820, 37
Type:
Small organic molecule
Emp. Form.:
C26H24N10O
Mol. Mass.:
492.5352
SMILES:
Cn1cncc1Cn1nc(cc1NC(=O)c1nc(ccc1Nc1cncnc1)C1CC1)-c1ccccn1
: