Target
cAMP and cAMP-inhibited cGMP 3',5'-cyclic phosphodiesterase 10A
Ligand
BDBM97531
Substrate
Meas. Tech.
Scintillation Proximity Assay (SPA)
pH
7.5±0
IC50
24±n/a nM
Citation
 Bleicher, KFlohr, AZbinden, KGKoerner, MKuhn, BPeters, JRodriguez-Sarmiento, RMVieira, E Nitrogen-containing heteroaryl derivatives US Patent  US8470820 Publication Date 6/25/2013 
Target
Name:
cAMP and cAMP-inhibited cGMP 3',5'-cyclic phosphodiesterase 10A
Synonyms:
3',5'-cyclic phosphodiesterase PDE10A Phosphodiesterase 10 (PDE10) | Phosphodiesterase 10A
Type:
Protein
Mol. Mass.:
88412.52
Organism:
Homo sapiens (Human)
Description:
Q9Y233
Residue:
1055
  
Inhibitor
Name:
BDBM97531
Synonyms:
Roche-Dataset for PDE10A, Compound 35 | US8470820, 42
Type:
Small organic molecule
Emp. Form.:
C25H27N9O
Mol. Mass.:
469.5416
SMILES:
CN(C)CCn1nc(NC(=O)c2nc(ccc2Nc2cncnc2)C2CC2)cc1-c1ccccn1
: