Target
Proto-oncogene tyrosine-protein kinase Src
Ligand
BDBM50193898
Substrate
Meas. Tech.
Luciferase-Based Assay
Temperature
298.15±n/a K
IC50
178±0.0 nM
Comments
extracted
Citation
 Gong, XBarrett, KCao, JGritzen, CNoronha, GHood, JDMak, CCMcPherson, APathak, VPRenick, JSoll, RMSplittgerber, UWrasidlo, WZeng, BZhao, NDneprovskaia, E Benzotriazine inhibitors of kinases US Patent  US8481536 Publication Date 7/9/2013 
Target
Name:
Proto-oncogene tyrosine-protein kinase Src
Synonyms:
Calmodulin/Proto-oncogene tyrosine-protein kinase Src Proto-oncogene c-Src SRC SRC_HUMAN V-src sarcoma (Schmidt-Ruppin A-2) viral oncogene homolog (avian) p60-Src | pp60c-src
Type:
Protein
Mol. Mass.:
59838.60
Organism:
Homo sapiens (Human)
Description:
P12931
Residue:
536
  
Inhibitor
Name:
BDBM50193898
Synonyms:
7-(2,6-dimethylphenyl)-5-methyl-N-m-tolylbenzo[e][1,2,4]triazin-3-amine US8481536, 332
Type:
Small organic molecule
Emp. Form.:
C23H22N4
Mol. Mass.:
354.4476
SMILES:
Cc1cccc(Nc2nnc3cc(cc(C)c3n2)-c2c(C)cccc2C)c1
: