Target
Dipeptidyl peptidase 2
Ligand
BDBM98069
Substrate
Dipeptidyl peptidase II and dipeptidyl peptidase IV (DPP2 and DPP4)
Meas. Tech.
DPP IV Assay
pH
5.5±0
Temperature
273.15±0 K
IC50
500000±100000 nM
Citation
 Senten, KDaniëls, LVan der Veken, PDe Meester, ILambeir, AMScharpé, SHaemers, AAugustyns, K Rapid parallel synthesis of dipeptide diphenyl phosphonate esters as inhibitors of dipeptidyl peptidases. J Comb Chem 5:336-44 (2003)  
Target
Name:
Dipeptidyl peptidase 2
Synonyms:
DAP II DPP2_HUMAN Dipeptidyl aminopeptidase II Dipeptidyl peptidase 2 (DPP2) Dipeptidyl peptidase II (DPP II) Dipeptidyl peptidase II and dipeptidyl peptidase IV (DPP2 and DPP4) carboxytripeptidase dipeptidyl(amino)peptidase II | dipeptidylarylamidase
Type:
Protein
Mol. Mass.:
54339.29
Organism:
Homo sapiens (Human)
Description:
Q9UHL4
Residue:
492
  
Inhibitor
Name:
BDBM98069
Synonyms:
(2S)-2-amino-3-cyclohexyl-N-(1-diphenoxyphosphorylbutyl)propanamide | Compound 9.19
Type:
Small organic molecule
Emp. Form.:
C25H35N2O4P
Mol. Mass.:
458.5302
SMILES:
CCCC(NC(=O)[C@@H](N)CC1CCCCC1)P(=O)(Oc1ccccc1)Oc1ccccc1
:
Substrate
Name:
Dipeptidyl peptidase 2
Synonyms:
DAP II DPP2_HUMAN Dipeptidyl aminopeptidase II Dipeptidyl peptidase 2 (DPP2) Dipeptidyl peptidase II (DPP II) Dipeptidyl peptidase II and dipeptidyl peptidase IV (DPP2 and DPP4) carboxytripeptidase dipeptidyl(amino)peptidase II | dipeptidylarylamidase
Type:
Protein
Mol. Mass.:
54339.29
Organism:
Homo sapiens (Human)
Description:
Q9UHL4
Residue:
492