Target
Dipeptidyl peptidase 2
Ligand
BDBM98077
Substrate
Dipeptidyl peptidase II and dipeptidyl peptidase IV (DPP2 and DPP4)
Meas. Tech.
DPP IV Assay
pH
5.5±0
Temperature
273.15±0 K
IC50
21000±1000 nM
Citation
 Senten, KDaniëls, LVan der Veken, PDe Meester, ILambeir, AMScharpé, SHaemers, AAugustyns, K Rapid parallel synthesis of dipeptide diphenyl phosphonate esters as inhibitors of dipeptidyl peptidases. J Comb Chem 5:336-44 (2003)  
Target
Name:
Dipeptidyl peptidase 2
Synonyms:
DAP II DPP2_HUMAN Dipeptidyl aminopeptidase II Dipeptidyl peptidase 2 (DPP2) Dipeptidyl peptidase II (DPP II) Dipeptidyl peptidase II and dipeptidyl peptidase IV (DPP2 and DPP4) carboxytripeptidase dipeptidyl(amino)peptidase II | dipeptidylarylamidase
Type:
Protein
Mol. Mass.:
54339.29
Organism:
Homo sapiens (Human)
Description:
Q9UHL4
Residue:
492
  
Inhibitor
Name:
BDBM98077
Synonyms:
(2S)-2,4-diamino-N-[cyclohexyl(diphenoxyphosphoryl)methyl]butanamide | Compound 9.27
Type:
Small organic molecule
Emp. Form.:
C23H32N3O4P
Mol. Mass.:
445.4916
SMILES:
NCC[C@H](N)C(=O)NC(C1CCCCC1)P(=O)(Oc1ccccc1)Oc1ccccc1
:
Substrate
Name:
Dipeptidyl peptidase 2
Synonyms:
DAP II DPP2_HUMAN Dipeptidyl aminopeptidase II Dipeptidyl peptidase 2 (DPP2) Dipeptidyl peptidase II (DPP II) Dipeptidyl peptidase II and dipeptidyl peptidase IV (DPP2 and DPP4) carboxytripeptidase dipeptidyl(amino)peptidase II | dipeptidylarylamidase
Type:
Protein
Mol. Mass.:
54339.29
Organism:
Homo sapiens (Human)
Description:
Q9UHL4
Residue:
492