Target
Dipeptidyl peptidase 2
Ligand
BDBM98087
Substrate
Dipeptidyl peptidase II and dipeptidyl peptidase IV (DPP2 and DPP4)
Meas. Tech.
DPP IV Assay
pH
5.5±0
Temperature
273.15±0 K
IC50
109000±7000 nM
Citation
 Senten, KDaniëls, LVan der Veken, PDe Meester, ILambeir, AMScharpé, SHaemers, AAugustyns, K Rapid parallel synthesis of dipeptide diphenyl phosphonate esters as inhibitors of dipeptidyl peptidases. J Comb Chem 5:336-44 (2003)  
Target
Name:
Dipeptidyl peptidase 2
Synonyms:
DAP II DPP2_HUMAN Dipeptidyl aminopeptidase II Dipeptidyl peptidase 2 (DPP2) Dipeptidyl peptidase II (DPP II) Dipeptidyl peptidase II and dipeptidyl peptidase IV (DPP2 and DPP4) carboxytripeptidase dipeptidyl(amino)peptidase II | dipeptidylarylamidase
Type:
Protein
Mol. Mass.:
54339.29
Organism:
Homo sapiens (Human)
Description:
Q9UHL4
Residue:
492
  
Inhibitor
Name:
BDBM98087
Synonyms:
Compound 9.38 | N-[diphenoxyphosphoryl(phenyl)methyl]-2-(sec-butylamino)acetamide
Type:
Small organic molecule
Emp. Form.:
C25H29N2O4P
Mol. Mass.:
452.4825
SMILES:
CCC(C)NCC(=O)NC(c1ccccc1)P(=O)(Oc1ccccc1)Oc1ccccc1
:
Substrate
Name:
Dipeptidyl peptidase 2
Synonyms:
DAP II DPP2_HUMAN Dipeptidyl aminopeptidase II Dipeptidyl peptidase 2 (DPP2) Dipeptidyl peptidase II (DPP II) Dipeptidyl peptidase II and dipeptidyl peptidase IV (DPP2 and DPP4) carboxytripeptidase dipeptidyl(amino)peptidase II | dipeptidylarylamidase
Type:
Protein
Mol. Mass.:
54339.29
Organism:
Homo sapiens (Human)
Description:
Q9UHL4
Residue:
492