Target
Vascular endothelial growth factor receptor 3
Ligand
BDBM98615
Substrate
Meas. Tech.
ELISA Assay
Temperature
293.15±0 K
IC50
14±0.0 nM
Citation
 Alam, ABiscarrat, SBlanc, IBono, FDuclos, OMccort, G Derivatives of 7-alkynyl-1,8-Naphthyridones, Preparation Method Therefore and Use of Same in Therapeutics US Patent  US8470847 Publication Date 6/25/2013 
Target
Name:
Vascular endothelial growth factor receptor 3
Synonyms:
FLT-4 Fms-like tyrosine kinase 4 VEGFR-3 VGFR3_HUMAN Vascular endothelial growth factor receptor 3 (VEGFR-3) | Vascular endothelial growth factor receptor 3 (VEGFR3)
Type:
Protein
Mol. Mass.:
152749.58
Organism:
Homo sapiens (Human)
Description:
P35916-2
Residue:
1363
  
Inhibitor
Name:
BDBM98615
Synonyms:
2-amino-1-ethyl-7-(3-hydroxy-3-phenyl-but-1-ynyl)-N-methyl-4-oxo-1,8-naphthyridine-3-carboxamide | US8470847, 62
Type:
Small organic molecule
Emp. Form.:
C22H22N4O3
Mol. Mass.:
390.4351
SMILES:
CCn1c(N)c(C(=O)NC)c(=O)c2ccc(nc12)C#CC(C)(O)c1ccccc1
: