Target
Macrophage colony-stimulating factor 1 receptor
Ligand
BDBM98623
Substrate
Meas. Tech.
Fluorescence Polarization Competition Assay
pH
7.5±0
IC50
0.72±n/a nM
Citation
 Illig, CRChen, JMeegalia, SKWall, MJ Inhibitors of c-fms kinase US Patent  US8497376 Publication Date 7/30/2013 
Target
Name:
Macrophage colony-stimulating factor 1 receptor
Synonyms:
CSF1R_MOUSE Csfmr Macrophage colony-stimulating factor 1 receptor Proto-oncogene c-Fms
Type:
Protein
Mol. Mass.:
109173.45
Organism:
Mus musculus (Mouse)
Description:
P09581
Residue:
977
  
Inhibitor
Name:
BDBM98623
Synonyms:
US8497376, 4
Type:
Small organic molecule
Emp. Form.:
C28H34N4O4
Mol. Mass.:
490.594
SMILES:
CC1(C)CCC(=CC1)c1cc(ccc1NC(=O)c1ncc([nH]1)C#N)[C@@H]1C[C@@]2(CO)CC[C@@](CO)(C1)O2
: