Target
Renin
Ligand
BDBM98675
Substrate
Meas. Tech.
FRET Assay
IC50
0.6±0.0 nM
Citation
 Yokokawa, FEhara, TKawakami, SIrie, OSuzuki, MHitomi, YToyao, A Organic compounds US Patent  US8497286 Publication Date 7/30/2013 
Target
Name:
Renin
Synonyms:
Angiotensinogenase RENI_HUMAN
Type:
Enzyme
Mol. Mass.:
45058.99
Organism:
Homo sapiens (Human)
Description:
Residue:
406
  
Inhibitor
Name:
BDBM98675
Synonyms:
US8497286, 151
Type:
Small organic molecule
Emp. Form.:
C31H54N4O5
Mol. Mass.:
562.7843
SMILES:
CCOC[C@@H](CC(C)C)NC(=O)[C@@H]1CNC[C@@H](C1)C(=O)N(CC(C)C)c1cc(OCCCOC)c(cn1)C(C)C
: