Target
Renin
Ligand
BDBM98676
Substrate
Meas. Tech.
FRET Assay
IC50
0.4±0.0 nM
Citation
 Yokokawa, FEhara, TKawakami, SIrie, OSuzuki, MHitomi, YToyao, A Organic compounds US Patent  US8497286 Publication Date 7/30/2013 
Target
Name:
Renin
Synonyms:
Angiotensinogenase RENI_HUMAN
Type:
Enzyme
Mol. Mass.:
45058.99
Organism:
Homo sapiens (Human)
Description:
Residue:
406
  
Inhibitor
Name:
BDBM98676
Synonyms:
US8497286, 152
Type:
Small organic molecule
Emp. Form.:
C30H50N4O6
Mol. Mass.:
562.7412
SMILES:
CCOC[C@@H](CC(C)C)NC(=O)[C@@H]1CNC[C@@H]([C@@H]1O)C(=O)N(C1CC1)c1cc(OCCCOC)c(cn1)C(C)C
: