Target
Renin
Ligand
BDBM98682
Substrate
Meas. Tech.
FRET Assay
IC50
0.8±0.0 nM
Citation
 Yokokawa, FEhara, TKawakami, SIrie, OSuzuki, MHitomi, YToyao, A Organic compounds US Patent  US8497286 Publication Date 7/30/2013 
Target
Name:
Renin
Synonyms:
Angiotensinogenase RENI_HUMAN
Type:
Enzyme
Mol. Mass.:
45058.99
Organism:
Homo sapiens (Human)
Description:
Residue:
406
  
Inhibitor
Name:
BDBM98682
Synonyms:
US8497286, 158
Type:
Small organic molecule
Emp. Form.:
C28H48N4O4
Mol. Mass.:
504.7051
SMILES:
CCOC[C@@H](CC(C)C)NC(=O)[C@@H]1CNC[C@@H](C1)C(=O)N(CC(C)C)c1cc(OC)c(cn1)C(C)C
: