Target
Renin
Ligand
BDBM98686
Substrate
Meas. Tech.
FRET Assay
IC50
0.3±0.0 nM
Citation
 Yokokawa, FEhara, TKawakami, SIrie, OSuzuki, MHitomi, YToyao, A Organic compounds US Patent  US8497286 Publication Date 7/30/2013 
Target
Name:
Renin
Synonyms:
Angiotensinogenase RENI_HUMAN
Type:
Enzyme
Mol. Mass.:
45058.99
Organism:
Homo sapiens (Human)
Description:
Residue:
406
  
Inhibitor
Name:
BDBM98686
Synonyms:
US8497286, 162
Type:
Small organic molecule
Emp. Form.:
C27H44N4O5
Mol. Mass.:
504.6621
SMILES:
CCOC[C@@H](CC(C)C)NC(=O)[C@@H]1CNC[C@@H]([C@@H]1O)C(=O)N(C1CC1)c1cc(OCC)c(CC)cn1
: