Target
Hepatocyte growth factor receptor
Ligand
BDBM99266
Substrate
Meas. Tech.
Time-Resolved Fluorescence Resonance Energy Transfer (TR-FRET) Assay
IC50
14±0.0 nM
Citation
 He, FDai, MFu, XLi, YLiu, LMi, YXu, YXun, GYu, ZZhang, JY Heterocyclic hydrazone compounds US Patent  US8497368 Publication Date 7/30/2013 
Target
Name:
Hepatocyte growth factor receptor
Synonyms:
Hepatocyte growth factor receptor Hepatocyte growth factor receptor (c-MET) MET Met proto-oncogene (hepatocyte growth factor receptor) Tyrosine-protein kinase Met (c-Met) c-Met kinase
Type:
Protein
Mol. Mass.:
155559.73
Organism:
Homo sapiens (Human)
Description:
P08581
Residue:
1390
  
Inhibitor
Name:
BDBM99266
Synonyms:
US8497368, 58
Type:
Small organic molecule
Emp. Form.:
C17H16N8O2S
Mol. Mass.:
396.426
SMILES:
CC(=NNS(C)(=O)=O)c1cnc2nnn(Cc3ccc4ncccc4c3)c2n1
: