Target
Focal adhesion kinase 1
Ligand
BDBM99830
Substrate
Meas. Tech.
In Vitro Enzyme Assay
IC50
999±0.0 nM
Citation
 Curry, MADorsey, BDDugan, BJGingrich, DEMesaros, EFMilkiewicz, KL Preparation and uses of 1,2,4-triazolo [1,5a] pyridine derivatives US Patent  US8501936 Publication Date 8/6/2013 
Target
Name:
Focal adhesion kinase 1
Synonyms:
FADK 1 FAK1 FLT4 Focal adhesion kinase (FAK) Focal adhesion kinase 1 (FAK) Focal adhesion kinase-related nonkinase PTK2 Protein-tyrosine kinase 2 p125FAK | pp125FAK
Type:
Tyrosine-protein kinase
Mol. Mass.:
119233.17
Organism:
Homo sapiens (Human)
Description:
Q05397
Residue:
1052
  
Inhibitor
Name:
BDBM99830
Synonyms:
US8501936, 348
Type:
Small organic molecule
Emp. Form.:
C24H25N5O
Mol. Mass.:
399.4882
SMILES:
COc1cccc(c1)-c1cccn2nc(Nc3ccc(cc3)C3CCNCC3)nc12
: