Target
Tyrosine-protein kinase JAK2
Ligand
BDBM99516
Substrate
Meas. Tech.
In Vitro Enzyme Assay
IC50
0.7±0.0 nM
Citation
 Curry, MADorsey, BDDugan, BJGingrich, DEMesaros, EFMilkiewicz, KL Preparation and uses of 1,2,4-triazolo [1,5a] pyridine derivatives US Patent  US8501936 Publication Date 8/6/2013 
Target
Name:
Tyrosine-protein kinase JAK2
Synonyms:
JAK-2 JAK2_HUMAN Janus kinase 2 (JAK2) | Janus kinase 2 (a protein tyrosine kinase)
Type:
Protein
Mol. Mass.:
130684.68
Organism:
Homo sapiens (Human)
Description:
O60674
Residue:
1132
  
Inhibitor
Name:
BDBM99516
Synonyms:
US8501936, 12
Type:
Small organic molecule
Emp. Form.:
C23H23N5O3S
Mol. Mass.:
449.525
SMILES:
CS(=O)(=O)c1ccc(cc1)-c1cccc2nc(Nc3ccc(cc3)N3CCOCC3)nn12
: