Target
Tyrosine-protein kinase JAK2
Ligand
BDBM99572
Substrate
Meas. Tech.
In Vitro Enzyme Assay
IC50
1.1±0.0 nM
Citation
 Curry, MADorsey, BDDugan, BJGingrich, DEMesaros, EFMilkiewicz, KL Preparation and uses of 1,2,4-triazolo [1,5a] pyridine derivatives US Patent  US8501936 Publication Date 8/6/2013 
Target
Name:
Tyrosine-protein kinase JAK2
Synonyms:
JAK-2 JAK2_HUMAN Janus kinase 2 (JAK2) | Janus kinase 2 (a protein tyrosine kinase)
Type:
Protein
Mol. Mass.:
130684.68
Organism:
Homo sapiens (Human)
Description:
O60674
Residue:
1132
  
Inhibitor
Name:
BDBM99572
Synonyms:
US8501936, 70
Type:
Small organic molecule
Emp. Form.:
C28H33N7O2S
Mol. Mass.:
531.672
SMILES:
CN1CCN(CC1)c1ccc(Nc2nc3cccc(-c4ccc(CN5CCS(=O)(=O)CC5)cc4)n3n2)cc1
: