Target
Tyrosine-protein kinase JAK2
Ligand
BDBM99617
Substrate
Meas. Tech.
In Vitro Enzyme Assay
IC50
1.43±0.0 nM
Citation
 Curry, MADorsey, BDDugan, BJGingrich, DEMesaros, EFMilkiewicz, KL Preparation and uses of 1,2,4-triazolo [1,5a] pyridine derivatives US Patent  US8501936 Publication Date 8/6/2013 
Target
Name:
Tyrosine-protein kinase JAK2
Synonyms:
JAK-2 JAK2_HUMAN Janus kinase 2 (JAK2) | Janus kinase 2 (a protein tyrosine kinase)
Type:
Protein
Mol. Mass.:
130684.68
Organism:
Homo sapiens (Human)
Description:
O60674
Residue:
1132
  
Inhibitor
Name:
BDBM99617
Synonyms:
US8501936, 118
Type:
Small organic molecule
Emp. Form.:
C25H28N6O2S
Mol. Mass.:
476.594
SMILES:
CN1CCN(Cc2cccc(Nc3nc4cccc(-c5ccc(cc5)S(C)(=O)=O)n4n3)c2)CC1
: