Target
Tyrosine-protein kinase JAK2
Ligand
BDBM99667
Substrate
Meas. Tech.
In Vitro Enzyme Assay
IC50
0.73±0.0 nM
Citation
 Curry, MADorsey, BDDugan, BJGingrich, DEMesaros, EFMilkiewicz, KL Preparation and uses of 1,2,4-triazolo [1,5a] pyridine derivatives US Patent  US8501936 Publication Date 8/6/2013 
Target
Name:
Tyrosine-protein kinase JAK2
Synonyms:
JAK-2 JAK2_HUMAN Janus kinase 2 (JAK2) | Janus kinase 2 (a protein tyrosine kinase)
Type:
Protein
Mol. Mass.:
130684.68
Organism:
Homo sapiens (Human)
Description:
O60674
Residue:
1132
  
Inhibitor
Name:
BDBM99667
Synonyms:
US8501936, 168
Type:
Small organic molecule
Emp. Form.:
C22H21N5O2S
Mol. Mass.:
419.499
SMILES:
CN1Cc2ccc(Nc3nc4c(cccn4n3)-c3ccc(cc3)S(C)(=O)=O)cc2C1
: