Target
Tyrosine-protein kinase JAK2
Ligand
BDBM99689
Substrate
Meas. Tech.
In Vitro Enzyme Assay
IC50
0.46±0.0 nM
Citation
 Curry, MADorsey, BDDugan, BJGingrich, DEMesaros, EFMilkiewicz, KL Preparation and uses of 1,2,4-triazolo [1,5a] pyridine derivatives US Patent  US8501936 Publication Date 8/6/2013 
Target
Name:
Tyrosine-protein kinase JAK2
Synonyms:
JAK-2 JAK2_HUMAN Janus kinase 2 (JAK2) | Janus kinase 2 (a protein tyrosine kinase)
Type:
Protein
Mol. Mass.:
130684.68
Organism:
Homo sapiens (Human)
Description:
O60674
Residue:
1132
  
Inhibitor
Name:
BDBM99689
Synonyms:
US8501936, 190
Type:
Small organic molecule
Emp. Form.:
C27H31N5O4S2
Mol. Mass.:
553.696
SMILES:
CS(=O)(=O)CCN1CCC(CC1)c1cccc(Nc2nc3c(cccn3n2)-c2ccc(cc2)S(C)(=O)=O)c1
: