Target
Tyrosine-protein kinase JAK2
Ligand
BDBM99702
Substrate
Meas. Tech.
In Vitro Enzyme Assay
IC50
1.63±0.0 nM
Citation
 Curry, MADorsey, BDDugan, BJGingrich, DEMesaros, EFMilkiewicz, KL Preparation and uses of 1,2,4-triazolo [1,5a] pyridine derivatives US Patent  US8501936 Publication Date 8/6/2013 
Target
Name:
Tyrosine-protein kinase JAK2
Synonyms:
JAK-2 JAK2_HUMAN Janus kinase 2 (JAK2) | Janus kinase 2 (a protein tyrosine kinase)
Type:
Protein
Mol. Mass.:
130684.68
Organism:
Homo sapiens (Human)
Description:
O60674
Residue:
1132
  
Inhibitor
Name:
BDBM99702
Synonyms:
US8501936, 204
Type:
Small organic molecule
Emp. Form.:
C24H24N6O3S
Mol. Mass.:
476.551
SMILES:
CN1CCN(C(=O)C1)c1cccc(Nc2nc3c(cccn3n2)-c2ccc(cc2)S(C)(=O)=O)c1
: