Target
Tyrosine-protein kinase JAK2
Ligand
BDBM99767
Substrate
Meas. Tech.
In Vitro Enzyme Assay
IC50
1.06±0.0 nM
Citation
 Curry, MADorsey, BDDugan, BJGingrich, DEMesaros, EFMilkiewicz, KL Preparation and uses of 1,2,4-triazolo [1,5a] pyridine derivatives US Patent  US8501936 Publication Date 8/6/2013 
Target
Name:
Tyrosine-protein kinase JAK2
Synonyms:
JAK-2 JAK2_HUMAN Janus kinase 2 (JAK2) | Janus kinase 2 (a protein tyrosine kinase)
Type:
Protein
Mol. Mass.:
130684.68
Organism:
Homo sapiens (Human)
Description:
O60674
Residue:
1132
  
Inhibitor
Name:
BDBM99767
Synonyms:
US8501936, 283
Type:
Small organic molecule
Emp. Form.:
C30H31FN8O
Mol. Mass.:
538.6185
SMILES:
CN(C)C(=O)CN1CCC(CC1)c1ccc(Nc2nc3c(cccn3n2)-c2cnn(c2)-c2ccc(F)cc2)cc1
: