Target
Tyrosine-protein kinase JAK3
Ligand
BDBM99830
Substrate
Meas. Tech.
In Vitro Enzyme Assay
IC50
218.66±0.0 nM
Citation
 Curry, MADorsey, BDDugan, BJGingrich, DEMesaros, EFMilkiewicz, KL Preparation and uses of 1,2,4-triazolo [1,5a] pyridine derivatives US Patent  US8501936 Publication Date 8/6/2013 
Target
Name:
Tyrosine-protein kinase JAK3
Synonyms:
JAK-3 JAK3_HUMAN Janus kinase 3 (JAK3) L-JAK | Leukocyte janus kinase
Type:
Protein
Mol. Mass.:
125111.08
Organism:
Homo sapiens (Human)
Description:
P52333
Residue:
1124
  
Inhibitor
Name:
BDBM99830
Synonyms:
US8501936, 348
Type:
Small organic molecule
Emp. Form.:
C24H25N5O
Mol. Mass.:
399.4882
SMILES:
COc1cccc(c1)-c1cccn2nc(Nc3ccc(cc3)C3CCNCC3)nc12
: