Target
Gag-Pol polyprotein
Ligand
BDBM25373
Substrate
Meas. Tech.
Enzyme Inhibition Assay
Ki
33±1.9 nM
Citation
 Ghosh, AK HIV protease inhibitors and methods for using US Patent  US8501961 Publication Date 8/6/2013 
Target
Name:
Gag-Pol polyprotein
Synonyms:
POL_HV1A2 gag-pol
Type:
Protein
Mol. Mass.:
162047.84
Organism:
Human immunodeficiency virus type 1 group M subtype B (isolate ARV2/SF2) (HIV-1)
Description:
P03369
Residue:
1437
  
Inhibitor
Name:
BDBM25373
Synonyms:
(R)-(hydroxyethylamino)sulfonamide isostere, 3j US8501961, 24 | US8501961, 3j
Type:
Small organic molecule
Emp. Form.:
C31H46N2O10S
Mol. Mass.:
638.769
SMILES:
COc1ccc(cc1)S(=O)(=O)N(CC(C)C)C[C@@H](O)[C@H](Cc1ccccc1)NC(=O)OC1COCCOCCOCCOC1
: