Target
Gag-Pol polyprotein
Ligand
BDBM99911
Substrate
Meas. Tech.
Enzyme Inhibition Assay
Ki
0.40±0.04 nM
Citation
 Ghosh, AK HIV protease inhibitors and methods for using US Patent  US8501961 Publication Date 8/6/2013 
Target
Name:
Gag-Pol polyprotein
Synonyms:
POL_HV1A2 gag-pol
Type:
Protein
Mol. Mass.:
162047.84
Organism:
Human immunodeficiency virus type 1 group M subtype B (isolate ARV2/SF2) (HIV-1)
Description:
P03369
Residue:
1437
  
Inhibitor
Name:
BDBM99911
Synonyms:
US8501961, 126
Type:
Small organic molecule
Emp. Form.:
C28H38N2O8S
Mol. Mass.:
562.675
SMILES:
COc1ccc(cc1)S(=O)(=O)N(CC(C)C)C[C@@H](O)[C@H](Cc1ccccc1)NC(=O)O[C@H]1CC2OCO[C@@H]2C1
: