Target
Gag-Pol polyprotein
Ligand
BDBM99916
Substrate
Meas. Tech.
Enzyme Inhibition Assay
Ki
0.34±0.07 nM
Citation
 Ghosh, AK HIV protease inhibitors and methods for using US Patent  US8501961 Publication Date 8/6/2013 
Target
Name:
Gag-Pol polyprotein
Synonyms:
POL_HV1A2 gag-pol
Type:
Protein
Mol. Mass.:
162047.84
Organism:
Human immunodeficiency virus type 1 group M subtype B (isolate ARV2/SF2) (HIV-1)
Description:
P03369
Residue:
1437
  
Inhibitor
Name:
BDBM99916
Synonyms:
US8501961, 130
Type:
Small organic molecule
Emp. Form.:
C28H38N2O8S
Mol. Mass.:
562.675
SMILES:
CC(C)CN(C[C@@H](O)[C@H](Cc1ccccc1)NC(=O)OC1CC2OCO[C@@H]2C1)S(=O)(=O)c1ccc(CO)cc1
: