Target
Tyrosine-protein kinase JAK3
Ligand
BDBM100350
Substrate
Meas. Tech.
Binding Assay
IC50
0.8±0.0 nM
Kd
2.7±0 nM
Citation
 Bauer, SMJia, ZJMehrotra, MSong, YXu, QHuang, WVenkataramani, CRose, JWPandey, A Inhibitors of protein kinases US Patent  US8501944 Publication Date 8/6/2013 
Target
Name:
Tyrosine-protein kinase JAK3
Synonyms:
JAK-3 JAK3_HUMAN Janus kinase 3 (JAK3) L-JAK | Leukocyte janus kinase
Type:
Protein
Mol. Mass.:
125111.08
Organism:
Homo sapiens (Human)
Description:
P52333
Residue:
1124
  
Inhibitor
Name:
BDBM100350
Synonyms:
US10533001, Example 99 US8501944, 372 US9868729, Example 99
Type:
Small organic molecule
Emp. Form.:
C19H25N7O3S
Mol. Mass.:
431.512
SMILES:
CS(=O)(=O)N1CCN(CC1)c1ccc(Nc2ncc(C(N)=O)c(NC3CC3)n2)cc1
: