Target
Epoxide hydrolase 1
Ligand
BDBM100435
Substrate
Meas. Tech.
Inhibition Assay
IC50
1.4±0.0 nM
Citation
 Hammock, BDJones, PDMorisseau, CHuang, HTsai, HGless, Jr., R Conformationally restricted urea inhibitors of soluble epoxide hydrolase US Patent  US8501783 Publication Date 8/6/2013 
Target
Name:
Epoxide hydrolase 1
Synonyms:
EPHX EPOX Epoxide hydrolase (HsEH) HYEP_HUMAN | Microsomal epoxide hydrolase
Type:
Protein
Mol. Mass.:
52954.28
Organism:
Homo sapiens (Human)
Description:
P07099
Residue:
455
  
Inhibitor
Name:
BDBM100435
Synonyms:
US8501783, 1701
Type:
Small organic molecule
Emp. Form.:
C17H29N3O3S
Mol. Mass.:
355.495
SMILES:
CS(=O)(=O)N1CCC(CC1)NC(=O)NC12CC3CC(CC(C3)C1)C2
: