Target
Pro-glucagon
Ligand
BDBM100856
Substrate
Meas. Tech.
Glucagon SPA Assay
pH
7.4±0
Ki
87.2±0.0 nM
Citation
 Aspnes, GEDidiuk, MTFilipski, KJGuzman-Perez, ALee, ECPfefferkorn, JAStevens, BDTu, MM Glucagon receptor modulators US Patent  US8507533 Publication Date 8/13/2013 
Target
Name:
Pro-glucagon
Synonyms:
GCG Glucagon | Glucagon receptor (GCGR)
Type:
Enzyme
Mol. Mass.:
20907.95
Organism:
Homo sapiens (Human)
Description:
P01275
Residue:
180
  
Inhibitor
Name:
BDBM100856
Synonyms:
US8507533, 181
Type:
Small organic molecule
Emp. Form.:
C24H26F3N5O3
Mol. Mass.:
489.4901
SMILES:
CC(C)(C)C(Nc1ccc(nc1)-n1cnc(c1)C(F)(F)F)c1ccc(cc1)C(=O)NCCC(O)=O
: