Target
Cyclin-dependent kinase 2
Ligand
BDBM2546
Substrate
Meas. Tech.
Kinase Assay
IC50
2±n/a nM
Citation
 Lücking, ULücking, MKrüger, RSiemeister, G Sulfoximine-substituted pyrimidines as CDK- and/or VEGF inhibitors, their production and use as pharmaceutical agents US Patent  US8507510 Publication Date 8/13/2013 
Target
Name:
Cyclin-dependent kinase 2
Synonyms:
CDK2 CDK2_HUMAN Cell division protein kinase 2 Protein cereblon/Cyclin-dependent kinase 2 | p33 protein kinase
Type:
Enzyme Subunit
Mol. Mass.:
33938.17
Organism:
Homo sapiens (Human)
Description:
P24941
Residue:
298
  
Inhibitor
Name:
BDBM2546
Synonyms:
US8507510, 1.42
Type:
Emp. Form.:
C16H22BrN5O2S
Mol. Mass.:
428.347
SMILES:
C[C@H](Nc1nc(Nc2ccc(cc2)S(C)(=N)=O)ncc1Br)C(C)(C)O
: